{"text_format":"1","workbook":"xlsx","n_sheets":21,"sheets":["Menu","Supuestos macro","Información Histórica","Tarifas","Paso 1 Y 2 -Alistamiento Datos","Paso 3 - Modelo econometrico","Reestimación 1","Reestimación 2","Reestimación 3","Reestimación 4","Resultados","Error y Linea base","Consolidado","Ajuste de Riesgo I","Ajuste de Riesgo II","Peajes Sin Info","Ingresos","No incremento de Tarifas ","Tarifas diferenciales","Otros","Contingente - PA"],"not_rendered":{"charts":0,"images":2,"macros":1,"external_links":0,"defined_names":0,"comments":2,"pivot_tables":0},"unopened":[],"bounds":{"document_bytes":16777216,"sheet_cells":100000,"rows_first":2000,"rows_last":500,"rows_between":2000,"halvings":0,"cell_chars":16384,"cell_head_chars":4096},"cells_cut":0,"cells_raw":0,"read":"whole","date_system":"1900"}

{"sheet":"Menu","index":0,"n_rows":63,"n_cols":10,"rows_kept":63,"cut":false,"hidden":false,"merged":[[8,1,9,11],[11,1,12,11],[61,3,62,3],[61,7,62,7],[15,1,15,11]]}
[]
[]
[]
[]
[]
[]
[]
[]
[null,"NOTA: Este archivo tiene como objetivo facilitar los cálculos que en el marco de la resolución 4859 de 2019 usted debe realizar. Sin embargo, deberá correr cuantas macro sean necesarias, de acuerdo con la información que tiene disponible. Es decir, en caso de contar con información que empieza desde fechas diferentes, deberá correr macros diferentes para incorporar TODA la información que tiene disponible.  "]
[]
[]
[null,"Le recomendamos presentar en este formatos los resultados finales de la valoración. En caso de haber corrido más de una macro, incluya en la pestaña \"Consolidado\" los resultados de la regresión y los errores de cada una de las macro utilizadas, y marque el archivo como \"Consolidado Final\"."]
[]
[]
[]
[null,"INSTRUCCIONES"]
[]
[]
[]
[]
[]
[]
[]
[]
[]
[]
[]
[]
[]
[]
[]
[]
[]
[]
[]
[]
[]
[]
[]
[]
{"$rows_left_out":24}
{"sheet":"Supuestos macro","index":1,"n_rows":762,"n_cols":20,"rows_kept":762,"cut":false,"hidden":false,"merged":[[1,1,1,3],[1,5,1,8],[1,10,1,13],[1,15,1,19],[2,15,3,19]]}
[null,null,null,null,null,null,null,null,null," "]
[null,"Supuestos macroeconómicos (Política macro) PIB HISTÓRICO",null,null,null,"Supuestos macroeconómicos (proyección escenario riesgo) PIB MENSUAL ",null,null,null,null,"IPC",null,null,null,null,"Proyección PIB mensual ( En valores) "]
[null,null,null,null,null,null,null,null,null,null,null,null,null,null,null,"Nota: Pegar  como valor el resultado de la columna H, en la columna S."]
[null,"Fecha de actualización ","2025-09-01",null,null,"Crecimiento escenario en riesgo",1.4999999999999999E-2,null,null,null,"Supuesto de inflación ",0.03]
[]
[null,"Año","PIB Interno Real ($ Millones de 2015)","Variación porcentual ",null,"Año","Mes","PIB Interno Real ($ Millones de 2015)","Variación porcentual ",null,"Año","IPC ","IPC Valor","Indice (Constantes 2015)",null,"Año","Mes","Código","PIB Interno Real ($ Millones de 2015)","Días hábiles"]
[null,2003,471264.17403718631,4.560975319753191,null,2003,"Enero ",{"$f":"$C$7/12","v":39272.014503098857},null,null,2002,51.477899999999998,51.477899999999998,1.7104427336779473,null,2003,"Enero ",{"$f":"CONCATENATE(P7,Q7)","v":"2003Enero "},39272.014503098857,21]
[null,2004,491303.07494386972,4.2521587701046304,null,2003,"Febrero ",{"$f":"$C$7/12","v":39272.014503098857},null,null,2003,53.07,53.07,{"$f":"$L$20/L8","v":1.6591294516676087},null,2003,"Febrero ",{"$f":"CONCATENATE(P8,Q8)","v":"2003Febrero "},39272.014503098857,20]
[null,2005,514853.00000000006,4.7933599965400031,null,2003,"Marzo",39272.014503098857,null,null,2004,55.99,55.99,1.5726022504018573,null,2003,"Marzo","2003Marzo",39272.014503098857,22]
[null,2006,549435,6.7168686984440118,null,2003,"Abril",39272.014503098857,null,null,2005,58.7,58.7,1.4999999999999998,null,2003,"Abril","2003Abril",39272.014503098857,19]
[null,2007,586456.99999999988,6.7381946909097268,null,2003,"Mayo",39272.014503098857,null,null,2006,61.33,61.33,1.4356758519484754,null,2003,"Mayo","2003Mayo",39272.014503098857,21]
[null,2008,605713,3.2834461861654285,null,2003,"Junio",39272.014503098857,null,null,2007,64.819999999999993,64.819999999999993,1.3583770441221845,null,2003,"Junio","2003Junio",39272.014503098857,20]
[null,2009,612616,1.1396486454806176,null,2003,"Julio",{"$f":"$C$7/12","v":39272.014503098857},null,null,2008,69.8,69.8,1.2614613180515759,null,2003,"Julio","2003Julio",39272.014503098857,20]
[null,2010,640151.00000000012,4.4946589707092421,null,2003,"Agosto",39272.014503098857,null,null,2009,71.2,71.2,1.2366573033707864,null,2003,"Agosto","2003Agosto",39272.014503098857,21]
[null,2011,684628,6.9478919817355322,null,2003,"Septiembre",39272.014503098857,null,null,2010,73.45,73.45,1.1987746766507827,null,2003,"Septiembre","2003Septiembre",39272.014503098857,20]
[null,2012,711415.00000000012,3.9126357671611656,null,2003,"Octubre",39272.014503098857,null,null,2011,76.19,76.19,1.1556634728967057,null,2003,"Octubre","2003Octubre",39272.014503098857,22]
[null,2013,747939.00000000012,5.1339935199567144,null,2003,"Noviembre",39272.014503098857,null,null,2012,78.05,78.05,1.1281229980781551,null,2003,"Noviembre","2003Noviembre",39272.014503098857,20]
[null,2014,781589.00000000023,4.4990300011097384,null,2003,"Diciembre",39272.014503098857,null,null,2013,79.56,79.56,1.1067119155354448,null,2003,"Diciembre","2003Diciembre",39272.014503098857,20]
[null,2015,804691.99999999988,2.9559013752751939,null,{"$f":"F7+1","v":2004},"Enero",{"$f":"$C$8/12","v":40941.922911989146},{"$f":"(H19-H7)/H7","v":4.2521587701046526E-2},null,2014,82.47,82.47,1.0676609676245907,null,{"$f":"P7+1","v":2004},"Enero","2004Enero",40941.922911989146,21]
[null,2016,821489,2.0873825016279657,null,{"$f":"F8+1","v":2004},"Febrero",{"$f":"$C$8/12","v":40941.922911989146},{"$f":"(H20-H8)/H8","v":4.2521587701046526E-2},null,2015,88.05,88.05,1,null,{"$f":"P8+1","v":2004},"Febrero","2004Febrero",40941.922911989146,20]
[null,2017,832656,1.3593608678874602,null,2004,"Marzo",40941.922911989146,4.2521587701046526E-2,null,2016,93.11,93.11,{"$f":"$L$20/L21","v":0.94565567608205348},null,2004,"Marzo","2004Marzo",40941.922911989146,18]
[null,2018,854008,2.5643242827770418,null,2004,"Abril",40941.922911989146,4.2521587701046526E-2,null,2017,96.92,96.92,0.90848122162608336,null,2004,"Abril","2004Abril",40941.922911989146,22]
[null,2019,881224,3.1868553924553344,null,2004,"Mayo",40941.922911989146,{"$f":"(H23-H11)/H11","v":4.2521587701046526E-2},null,2018,100,100,0.88049999999999995,null,2004,"Mayo","2004Mayo",40941.922911989146,20]
[null,2020,817900,-7.1859141376085951,null,{"$f":"F12+1","v":2004},"Junio",{"$f":"$C$8/12","v":40941.922911989146},4.2521587701046526E-2,null,2019,103.8,103.8,0.84826589595375723,null,{"$f":"P12+1","v":2004},"Junio","2004Junio",40941.922911989146,19]
[null,2021,906243,10.801198190487838,null,2004,"Julio",40941.922911989146,4.2521587701046526E-2,null,2020,105.48,105.48,{"$f":"$L$20/L25","v":0.83475540386803182},null,2004,"Julio","2004Julio",40941.922911989146,23]
[null,2022,972655.00000000012,7.3282772942798058,null,2004,"Agosto",40941.922911989146,4.2521587701046526E-2,null,2021,111.41,111.41,{"$f":"$L$20/L26","v":0.79032402836370164},null,2004,"Agosto","2004Agosto",40941.922911989146,19]
[null,2023,979584,0.71238003197433564,null,2004,"Septiembre",40941.922911989146,4.2521587701046526E-2,null,2022,126.03,126.03,{"$f":"$L$20/L27","v":0.69864318019519156},null,2004,"Septiembre","2004Septiembre",40941.922911989146,22]
[null,2024,995240.51329762861,1.5982818520544173,null,2004,"Octubre",40941.922911989146,4.2521587701046526E-2,null,2023,137.72,137.72,{"$f":"$L$20/L28","v":0.63934069125762416},null,2004,"Octubre","2004Octubre",40941.922911989146,22]
[null,2025,1021720.60229737,2.6606723345698802,null,2004,"Noviembre",40941.922911989146,4.2521587701046526E-2,null,2024,144.88,144.88,{"$f":"$L$20/L29","v":0.60774434014356704},null,2004,"Noviembre","2004Noviembre",40941.922911989146,18]
[null,2026,1051904.58402954,2.9542305072737474,null,2004,"Diciembre",40941.922911989146,4.2521587701046526E-2,null,2025,{"$f":"L29*(1+0.0452236352692621)","v":151.43200027781069},149.44990260908514,0.58144909819897528,null,2004,"Diciembre","2004Diciembre",40941.922911989146,21]
[null,"Fuente: Política Macro MHCP ",null,null,null,2005,"Enero",{"$f":"$D$34/3","v":42101.279905797332},2.8317111443456104E-2,null,2026,{"$f":"L30*(1+0.0315426739997595)","v":156.20857049570517},153.93339968735771,0.56366945629542686,null,2005,"Enero","2005Enero",42101.279905797332,20]
[null,null,null,null,null,2005,"Febrero",{"$f":"$D$34/3","v":42101.279905797332},2.8317111443456104E-2,null,2027,{"$f":"L31*(1+$L$4)","v":160.89482761057633},158.55140167797845,{"$f":"$L$20/L32","v":0.54725189931594842},null,2005,"Febrero","2005Febrero",42101.279905797332,20]
[null,"Año","Trimestre","PIB Interno Real ($ Millones de 2015)",null,2005,"Marzo",{"$f":"$D$34/3","v":42101.279905797332},2.8317111443456104E-2,null,2028,{"$f":"L32*(1+$L$4)","v":165.72167243889362},163.30794372831781,0.53131252360771697,null,2005,"Marzo","2005Marzo",42101.279905797332,20]
[null,2005,"I",126303.83971739199,null,2005,"Abril",{"$f":"$D$35/3","v":42920.205588261},4.8319241881346703E-2,null,2029,170.69332261206043,168.20718204016734,0.5158374015608902,null,2005,"Abril","2005Abril",42920.205588261,22]
[null,2005,"II",128760.616764783,null,2005,"Mayo",{"$f":"$D$35/3","v":42920.205588261},4.8319241881346703E-2,null,2030,175.81412229042223,173.25339750137238,0.50081301122416533,null,2005,"Mayo","2005Mayo",42920.205588261,20]
[null,2005,"III",128746.26301131101,null,2005,"Junio",{"$f":"$D$35/3","v":42920.205588261},4.8319241881346703E-2,null,2031,181.0885459591349,178.45099942641355,0.48622622448948083,null,2005,"Junio","2005Junio",42920.205588261,21]
[null,2005,"IV",131042.28038767799,null,2005,"Julio",{"$f":"$D$36/3","v":42915.421003770338},4.8202379160928135E-2,null,2032,186.52120233790896,183.80452940920597,0.47206429562085517,null,2005,"Julio","2005Julio",42915.421003770338,19]
[null,{"$f":"B34+1","v":2006},"I",133975.643976758,null,2005,"Agosto",{"$f":"$D$36/3","v":42915.421003770338},4.8202379160928135E-2,null,2033,192.11683840804622,189.31866529148215,0.45831485011733514,null,2005,"Agosto","2005Agosto",42915.421003770338,22]
[null,{"$f":"B35+1","v":2006},"II",136054.52325454401,null,2005,"Septiembre",{"$f":"$D$36/3","v":42915.421003770338},4.8202379160928135E-2,null,2034,197.8803435602876,194.99822525022662,0.44496587390032538,null,2005,"Septiembre","2005Septiembre",42915.421003770338,22]
[null,2006,"III",138623.80996544901,null,2005,"Octubre",{"$f":"$D$37/3","v":43680.760129226001},6.6895666408351151E-2,null,2035,203.81675386709622,200.84817200773344,{"$f":"$L$20/L40","v":0.43200570281584988},null,2005,"Octubre","2005Octubre",43680.760129226001,20]
{"$rows_left_out":723}
{"sheet":"Información Histórica","index":2,"n_rows":16,"n_cols":17,"rows_kept":16,"cut":false,"hidden":false,"merged":[[2,1,3,1],[2,2,3,2],[2,3,2,16],[1,3,1,16]]}
[]
[]
[null,"Año","Mes","Categorías "]
[null,null,null,"I","II","III","IV","V","VI","VII","IE","IIE","IIIE","IVE","VE","VIE","VIIE"]
[null,null,"Enero"]
[null,null,"Febrero"]
[null,null,"Marzo"]
[null,null,"Abril"]
[null,null,"Mayo"]
[null,null,"Junio"]
[null,null,"Julio"]
[null,null,"Agosto"]
[null,null,"Septiembre"]
[null,null,"Octubre"]
[null,null,"Noviembre"]
[null,null,"Diciembre"]

{"sheet":"Tarifas","index":3,"n_rows":5,"n_cols":32,"rows_kept":5,"cut":false,"hidden":false,"merged":[[1,1,1,15],[1,17,1,31],[2,2,2,15],[2,18,2,31],[2,1,3,1],[2,17,3,17]]}
[]
[null,null,null,null,null,null,null,null,null,null,null,null,null,null,null,null,null,{"$f":"B2","v":0}]
[null,"Año ","Corrientes",null,null,null,null,null,null,null,null,null,null,null,null,null,null,"Año ","Constantes (2015)"]
[null,null,"I","II","III","IV","V","VI","VII","IE","IIE","IIIE","IVE","VE","VIE","VIIE",null,null,"I","II","III","IV","V","VI","VII","IE","IIE","IIIE","IVE","VE","VIE","VIIE"]
[null,null,null,null,null,null,null,null,null,null,null,null,null,null,null,null,null,null,{"$f":"MROUND((C5*VLOOKUP($R5,'Supuestos macro'!$K$7:$N$56,4,FALSE)),100)","v":{"$error":"#N/A"}},{"$f":"MROUND((D5*VLOOKUP($R5,'Supuestos macro'!$K$7:$N$56,4,FALSE)),100)","v":{"$error":"#N/A"}},{"$f":"MROUND((E5*VLOOKUP($R5,'Supuestos macro'!$K$7:$N$56,4,FALSE)),100)","v":{"$error":"#N/A"}},{"$f":"MROUND((F5*VLOOKUP($R5,'Supuestos macro'!$K$7:$N$56,4,FALSE)),100)","v":{"$error":"#N/A"}},{"$f":"MROUND((G5*VLOOKUP($R5,'Supuestos macro'!$K$7:$N$56,4,FALSE)),100)","v":{"$error":"#N/A"}},{"$f":"MROUND((H5*VLOOKUP($R5,'Supuestos macro'!$K$7:$N$56,4,FALSE)),100)","v":{"$error":"#N/A"}},{"$f":"MROUND((I5*VLOOKUP($R5,'Supuestos macro'!$K$7:$N$56,4,FALSE)),100)","v":{"$error":"#N/A"}},{"$f":"MROUND((J5*VLOOKUP($R5,'Supuestos macro'!$K$7:$N$56,4,FALSE)),100)","v":{"$error":"#N/A"}},{"$f":"MROUND((K5*VLOOKUP($R5,'Supuestos macro'!$K$7:$N$56,4,FALSE)),100)","v":{"$error":"#N/A"}},{"$f":"MROUND((L5*VLOOKUP($R5,'Supuestos macro'!$K$7:$N$56,4,FALSE)),100)","v":{"$error":"#N/A"}},{"$f":"MROUND((M5*VLOOKUP($R5,'Supuestos macro'!$K$7:$N$56,4,FALSE)),100)","v":{"$error":"#N/A"}},{"$f":"MROUND((N5*VLOOKUP($R5,'Supuestos macro'!$K$7:$N$56,4,FALSE)),100)","v":{"$error":"#N/A"}},{"$f":"MROUND((O5*VLOOKUP($R5,'Supuestos macro'!$K$7:$N$56,4,FALSE)),100)","v":{"$error":"#N/A"}},{"$f":"MROUND((P5*VLOOKUP($R5,'Supuestos macro'!$K$7:$N$56,4,FALSE)),100)","v":{"$error":"#N/A"}}]

{"sheet":"Paso 1 Y 2 -Alistamiento Datos","index":4,"n_rows":3982,"n_cols":121,"rows_kept":3982,"cut":false,"hidden":false,"merged":[[1,118,2,118],[1,119,2,119],[1,120,2,120],[1,2,3,2],[1,112,2,112],[1,113,2,113],[1,114,2,114],[1,115,2,115],[1,116,2,116],[1,117,2,117],[1,106,2,106],[1,107,2,107],[1,108,2,108],[1,109,2,109],[1,110,2,110],[1,111,2,111],[1,100,2,100],[1,101,2,101],[1,102,2,102],[1,103,2,103],[1,104,2,104],[1,105,2,105],[1,94,2,94],[1,95,2,95],[1,96,2,96],[1,97,2,97],[1,98,2,98],[1,99,2,99],[1,88,2,88],[1,89,2,89],[1,90,2,90],[1,91,2,91],[1,92,2,92],[1,93,2,93],[1,82,2,82],[1,83,2,83],[1,84,2,84],[1,85,2,85],[1,86,2,86],[1,87,2,87],[1,76,2,76],[1,77,2,77],[1,78,2,78],[1,79,2,79],[1,80,2,80],[1,81,2,81],[1,70,2,70],[1,71,2,71],[1,72,2,72],[1,73,2,73],[1,74,2,74],[1,75,2,75],[1,64,2,64],[1,65,2,65],[1,66,2,66],[1,67,2,67],[1,68,2,68],[1,69,2,69],[1,58,2,58],[1,59,2,59],[1,60,2,60],[1,61,2,61],[1,62,2,62],[1,63,2,63],[1,52,2,52],[1,53,2,53],[1,54,2,54],[1,55,2,55],[1,56,2,56],[1,57,2,57],[1,46,2,46],[1,47,2,47],[1,48,2,48],[1,49,2,49],[1,50,2,50],[1,51,2,51],[1,40,2,40],[1,41,2,41],[1,42,2,42],[1,43,2,43],[1,44,2,44],[1,45,2,45],[1,34,2,34],[1,35,2,35],[1,36,2,36],[1,37,2,37],[1,38,2,38],[1,39,2,39],[1,28,2,28],[1,29,2,29],[1,30,2,30],[1,31,2,31],[1,32,2,32],[1,33,2,33],[1,24,2,24],[1,25,2,25],[1,26,2,26],[1,27,2,27],[1,16,2,16],[1,17,2,17],[1,18,2,18],[1,19,2,19],[1,20,2,20],[1,21,2,21],[1,10,2,10],[1,11,2,11],[1,12,2,12],[1,13,2,13],[1,14,2,14],[1,15,2,15],[0,91,0,120],[1,0,3,0],[1,1,3,1],[1,3,3,3],[1,4,3,4],[1,5,2,5],[1,6,2,6],[1,7,2,7],[1,8,2,8],[1,9,2,9],[0,0,0,4],[0,5,0,18],[0,19,0,32],[0,33,0,46],[0,47,0,76],[0,77,0,90],[1,22,2,22],[1,23,2,23]]}
[null,null,null,null,null,"Variable Dependiente",null,null,null,null,null,null,null,null,null,null,null,null,null,"Variable Dependiente TPD",null,null,null,null,null,null,null,null,null,null,null,null,null,"Variable Dependiente suavizada",null,null,null,null,null,null,null,null,null,null,null,null,null,"Variables Independiente",null,null,null,null,null,null,null,null,null,null,null,null,null,null,null,null,null,null,null,null,null,null,null,null,null,null,null,null,null,"Variable Dependiente",null,null,null,null,null,null,null,null,null,null,null,null,null,"Variables Independiente - Log Diferencias"]
["Año ","Mes","#","Días del Mes","Días Habiles ","I","II","III","IV","V","VI","VII","IE","IIE","IIIE","IVE","VE","VIE","VIIE","I","II","III","IV","V","VI","VII","IE","IIE","IIIE","IVE","VE","VIE","VIIE","I","II","III","IV","V","VI","VII","IE","IIE","IIIE","IVE","VE","VIE","VIIE","PIB","Tarifas ","Tarifas ","Tarifas ","Tarifas ","Tarifas ","Tarifas ","Tarifas ","Tarifas ","Tarifas ","Tarifas ","Tarifas ","Tarifas ","Tarifas ","Tarifas ","Proporción Días hábiles","Dummy","Dummy","Dummy","Dummy","Dummy","Dummy","Dummy","Dummy","Dummy","Dummy","Dummy","Dummy","Dummy","Dummy","I","II","III","IV","V","VI","VII","IE","IIE","IIIE","IVE","VE","VIE","VIIE","PIB","Tarifas ","Tarifas ","Tarifas ","Tarifas ","Tarifas ","Tarifas ","Tarifas ","Tarifas ","Tarifas ","Tarifas ","Tarifas ","Tarifas ","Tarifas ","Tarifas ","Proporción Días hábiles","Dummy","Dummy","Dummy","Dummy","Dummy","Dummy","Dummy","Dummy","Dummy","Dummy","Dummy","Dummy","Dummy","Dummy"]
[]
[null,null,null,null,null,"Mensual","Mensual","Mensual","Mensual","Mensual","Mensual","Mensual","Mensual","Mensual","Mensual","Mensual","Mensual","Mensual","Mensual","TPD","TPD","TPD","TPD","TPD","TPD","TPD","TPD","TPD","TPD","TPD","TPD","TPD","TPD","Suavizada","Suavizada","Suavizada","Suavizada","Suavizada","Suavizada","Suavizada","Suavizada","Suavizada","Suavizada","Suavizada","Suavizada","Suavizada","Suavizada","Mensual","I","II","III","IV","V","VI","VII","IE","IIE","IIIE","IVE","VE","VIE","VIIE",null,"I","II","III","IV","V","VI","VII","IE","IIE","IIIE","IVE","VE","VIE","VIIE","Log diferencias","Log diferencias","Log diferencias","Log diferencias","Log diferencias","Log diferencias","Log diferencias","Log diferencias","Log diferencias","Log diferencias","Log diferencias","Log diferencias","Log diferencias","Log diferencias","Log diferencias","I","II","III","IV","V","VI","VII","IE","IIE","IIIE","IVE","VE","VIE","VIIE",null,"I","II","III","IV","V","VI","VII","IE","IIE","IIIE","IVE","VE","VIE","VIIE"]
[null,"Enero"]
[null,"Febrero"]
[null,"Marzo"]
[null,"Abril"]
[null,"Mayo"]
[null,"Junio"]
[null,"Julio"]
[null,"Agosto"]
[null,"Septiembre"]
[null,"Octubre"]
[null,"Noviembre"]
[null,"Diciembre"]
[null,"Enero"]
[null,"Febrero"]
[null,"Marzo"]
[null,"Abril"]
[null,"Mayo"]
[null,"Junio"]
[null,"Julio"]
[null,"Agosto"]
[null,"Septiembre"]
[null,"Octubre"]
[null,"Noviembre"]
[null,"Diciembre"]
[]
[]
[]
[]
[]
[]
[]
[]
[]
[]
[]
[]
{"$rows_left_out":3943}
{"sheet":"Paso 3 - Modelo econometrico","index":5,"n_rows":30,"n_cols":8,"rows_kept":30,"cut":false,"hidden":false,"merged":[[2,1,2,4]]}
[null,"ESTIMACIÓN INICIAL "]
[]
[]
[]
[null,null,null,null,"I"]
[null,"Año ","Mes","Variable dependiente (y)","PIB (X1)","Tarifa (X2)","Proporción días (X3)","Dummy"]
[null,null,"Enero"]
[null,null,"Febrero"]
[null,null,"Marzo"]
[null,null,"Abril"]
[null,null,"Mayo"]
[null,null,"Junio"]
[null,null,"Julio"]
[null,null,"Agosto"]
[null,null,"Septiembre"]
[null,null,"Octubre"]
[null,null,"Noviembre"]
[null,null,"Diciembre"]
[null,null,"Enero"]
[null,null,"Febrero"]
[null,null,"Marzo"]
[null,null,"Abril"]
[null,null,"Mayo"]
[null,null,"Junio"]
[null,null,"Julio"]
[null,null,"Agosto"]
[null,null,"Septiembre"]
[null,null,"Octubre"]
[null,null,"Noviembre"]
[null,null,"Diciembre"]

{"sheet":"Reestimación 1","index":6,"n_rows":0,"n_cols":0,"rows_kept":0,"cut":false,"hidden":false,"merged":[]}

{"sheet":"Reestimación 2","index":7,"n_rows":0,"n_cols":0,"rows_kept":0,"cut":false,"hidden":false,"merged":[]}

{"sheet":"Reestimación 3","index":8,"n_rows":0,"n_cols":0,"rows_kept":0,"cut":false,"hidden":false,"merged":[]}

{"sheet":"Reestimación 4","index":9,"n_rows":0,"n_cols":0,"rows_kept":0,"cut":false,"hidden":false,"merged":[]}

{"sheet":"Resultados","index":10,"n_rows":7,"n_cols":17,"rows_kept":7,"cut":false,"hidden":false,"merged":[]}
[null,"Resultados Estimadores "]
[null,null,"Aburrá","I","II","III","IV","V","VI","VII","IE","IIE","IIIE","IVE","VE","VIE","VIIE"]
[null,null,"Constante"]
[null,null,"PIB"]
[null,null,"Tarifa "]
[null,null,"Proporción Días "]
[null,null,"Dummy"]

{"sheet":"Error y Linea base","index":11,"n_rows":7,"n_cols":3,"rows_kept":7,"cut":false,"hidden":false,"merged":[]}
[]
[null,null,"Percentil "]
[null,null,0.95]
[]
[]
[]
[null,"Año ","Mes"]

{"sheet":"Consolidado","index":12,"n_rows":2,"n_cols":3,"rows_kept":2,"cut":false,"hidden":false,"merged":[[1,2,2,10]]}
[]
[null,null,"NOTA: En caso en que haya tenido que correr varias macro para un mismo proyecto, incluya en esta hoja los resultados de la hoja \"Error y Linea base\" de esta y las demás macro que corrió, para luego continuar con los demás pasos de la valoración "]

{"sheet":"Ajuste de Riesgo I","index":13,"n_rows":2,"n_cols":3,"rows_kept":2,"cut":false,"hidden":false,"merged":[[1,2,2,10]]}
[]
[null,null,"Nota: En esta hoja incluya el Ajuste de Riesgo I de TODOS los peajes del proyecto en los que aplicó el caso CON INFORMACIÓN"]

{"sheet":"Ajuste de Riesgo II","index":14,"n_rows":2,"n_cols":3,"rows_kept":2,"cut":false,"hidden":false,"merged":[[1,2,2,10]]}
[]
[null,null,"Nota: En esta hoja incluya el Ajuste de Riesgo II de TODOS los peajes del proyecto en los que aplicó el caso CON INFORMACIÓN"]

{"sheet":"Peajes Sin Info","index":15,"n_rows":2,"n_cols":3,"rows_kept":2,"cut":false,"hidden":false,"merged":[[1,2,2,10]]}
[]
[null,null,"Nota: En esta hoja realice la valoración de los peajes para el CASO SIN INFORMACIÓN (Demanda)"]

{"sheet":"Ingresos","index":16,"n_rows":5,"n_cols":3,"rows_kept":5,"cut":false,"hidden":false,"merged":[[1,2,2,10],[4,2,5,10]]}
[]
[null,null,"Nota: En esta hoja incluya las tarifas de los peajes CON y SIN información y estime los ingresos respectivos del proyecto para el riesgo de demanda "]
[]
[]
[null,null,"Nota 2: Al final de esta hoja se deberá reflejar el valor contingente TOTAL del proyecto. "]

{"sheet":"No incremento de Tarifas ","index":17,"n_rows":2,"n_cols":3,"rows_kept":2,"cut":false,"hidden":false,"merged":[[1,2,2,10]]}
[]
[null,null,"Nota: En esta hoja incluya la valoración de no incremento de Tarifas, en caso en que aplique, y pase los resultados a la hoja Ingresos. "]

{"sheet":"Tarifas diferenciales","index":18,"n_rows":2,"n_cols":3,"rows_kept":2,"cut":false,"hidden":false,"merged":[[1,2,2,10]]}
[]
[null,null,"Nota: En esta hoja incluya la valoración de Tarifas diferenciales, en caso en que aplique, y pase los resultados a la hoja Ingresos. "]

{"sheet":"Otros","index":19,"n_rows":2,"n_cols":3,"rows_kept":2,"cut":false,"hidden":false,"merged":[[1,2,2,10]]}
[]
[null,null,"Nota:En caso de tener más riesgos que deben ser valorados, incluya una pestaña por cada riesgo adicional que se valorará "]

{"sheet":"Contingente - PA","index":20,"n_rows":2,"n_cols":3,"rows_kept":2,"cut":false,"hidden":false,"merged":[[1,2,2,10]]}
[]
[null,null,"Nota: Esta hoja deberá tener el resumen del contingente de cada riesgo valorado y el plan de aportes que se someterá a aprobación, en caso en que aplique. "]